Target
Vasopressin V1a receptor
Ligand
BDBM50178185
Substrate
Meas. Tech.
ChEMBL_326539 (CHEMBL863357)
Ki
>10000±n/a nM
Citation
 Quattropani, ADorbais, JCovini, DPittet, PAColovray, VThomas, RJCoxhead, RHalazy, SScheer, AMissotten, MAyala, GBradshaw, CDe Raemy-Schenk, AMNichols, ACirillo, RTos, EGGiachetti, CGolzio, LMarinelli, PChurch, DJBarberis, CChollet, ASchwarz, MK Discovery and development of a new class of potent, selective, orally active oxytocin receptor antagonists. J Med Chem 48:7882-905 (2005)  
Target
Name:
Vasopressin V1a receptor
Synonyms:
AVPR V1a AVPR1A V1AR_HUMAN VASOPRESSIN V1A Vasopressin V1 receptor Vasopressin receptor
Type:
Receptor
Mol. Mass.:
46820.18
Organism:
Homo sapiens (Human)
Description:
P37288
Residue:
418
  
Inhibitor
Name:
BDBM50178185
Synonyms:
3-({[4-chloro({4-[3-(dimethylamino)propoxy]phenyl}sulfonyl)anilino]acetyl}hydrazono)-2-oxo-2,3-dihydro-1H-indole-7-carboxylic acid | CHEMBL200904
Type:
Small organic molecule
Emp. Form.:
C28H28ClN5O7S
Mol. Mass.:
614.069
SMILES:
CN(C)CCCOc1ccc(cc1)S(=O)(=O)N(CC(=O)N=Nc1c(O)[nH]c2c(cccc12)C(O)=O)c1ccc(Cl)cc1
: