Target
cAMP-specific 3',5'-cyclic phosphodiesterase 4C
Ligand
BDBM50174018
Substrate
Meas. Tech.
ChEMBL_326771 (CHEMBL860121)
IC50
2.9±n/a nM
Citation
 Macdonald, DMastracchio, APerrier, HDubé, DGallant, MLacombe, PDeschênes, DRoy, BScheigetz, JBateman, KLi, CTrimble, LADay, SChauret, NNicoll-Griffith, DASilva, JMHuang, ZLaliberté, FLiu, SEthier, DPon, DMuise, EBoulet, LChan, CCStyhler, ACharleson, SMancini, JMasson, PClaveau, DNicholson, DTurner, MYoung, RNGirard, Y Discovery of a substituted 8-arylquinoline series of PDE4 inhibitors: structure-activity relationship, optimization, and identification of a highly potent, well tolerated, PDE4 inhibitor. Bioorg Med Chem Lett 15:5241-6 (2005)  
Target
Name:
cAMP-specific 3',5'-cyclic phosphodiesterase 4C
Synonyms:
3',5'-cyclic phosphodiesterase NP_000914.2 PDE4C | PDE4C1
Type:
Enzyme Catalytic Domain
Mol. Mass.:
79875.54
Organism:
Homo sapiens (Human)
Description:
Q08493
Residue:
712
  
Inhibitor
Name:
BDBM50174018
Synonyms:
(E)-N-isopropyl-3-(3-(6-isopropylquinolin-8-yl)phenyl)-2-(4-(methylsulfonyl)phenyl)acrylamide | CHEMBL371089
Type:
Small organic molecule
Emp. Form.:
C31H32N2O3S
Mol. Mass.:
512.662
SMILES:
CC(C)NC(=O)C(=C\c1cccc(c1)-c1cc(cc2cccnc12)C(C)C)\c1ccc(cc1)S(C)(=O)=O
: