Target
cAMP-specific 3',5'-cyclic phosphodiesterase 4D
Ligand
BDBM50174020
Substrate
Meas. Tech.
ChEMBL_326772 (CHEMBL860122)
IC50
0.4±n/a nM
Citation
 Macdonald, DMastracchio, APerrier, HDubé, DGallant, MLacombe, PDeschênes, DRoy, BScheigetz, JBateman, KLi, CTrimble, LADay, SChauret, NNicoll-Griffith, DASilva, JMHuang, ZLaliberté, FLiu, SEthier, DPon, DMuise, EBoulet, LChan, CCStyhler, ACharleson, SMancini, JMasson, PClaveau, DNicholson, DTurner, MYoung, RNGirard, Y Discovery of a substituted 8-arylquinoline series of PDE4 inhibitors: structure-activity relationship, optimization, and identification of a highly potent, well tolerated, PDE4 inhibitor. Bioorg Med Chem Lett 15:5241-6 (2005)  
Target
Name:
cAMP-specific 3',5'-cyclic phosphodiesterase 4D
Synonyms:
3',5'-cyclic phosphodiesterase PDE43 PDE4D_HUMAN | Phosphodiesterase 4D
Type:
Protein
Mol. Mass.:
91092.69
Organism:
Homo sapiens (Human)
Description:
Q08499
Residue:
809
  
Inhibitor
Name:
BDBM50174020
Synonyms:
(S)-(+)-3-{2-[(3-Cyclopropyloxy-4-difluromethoxy)-phenyl]-2-[5-(2-(1-hydroxy-1-trifluoromethyl-2,2,2-trifluoro)ethyl)-thiazolyl]ethyl}pyridine N-Oxide CHEMBL199015 | L-869298
Type:
Small organic molecule
Emp. Form.:
C23H18F8N2O4S
Mol. Mass.:
570.452
SMILES:
OC(c1ncc(s1)[C@@H](Cc1ccc[n+]([O-])c1)c1ccc(OC(F)F)c(OC2CC2)c1)(C(F)(F)F)C(F)(F)F
: