Target
GABA-A receptor; alpha-2/beta-3/gamma-2
Ligand
BDBM50180004
Substrate
Meas. Tech.
ChEMBL_329743 (CHEMBL864003)
Ki
0.52±n/a nM
Citation
 Goodacre, SCStreet, LJHallett, DJCrawforth, JMKelly, SOwens, APBlackaby, WPLewis, RTStanley, JSmith, AJFerris, PSohal, BCook, SMPike, ABrown, NWafford, KAMarshall, GCastro, JLAtack, JR Imidazo[1,2-a]pyrimidines as functionally selective and orally bioavailable GABA(A)alpha2/alpha3 binding site agonists for the treatment of anxiety disorders. J Med Chem 49:35-8 (2006)  
Target
Name:
GABA-A receptor; alpha-2/beta-3/gamma-2
Synonyms:
GABA receptor alpha-2/beta-3/gamma-2 subunit | Gamma-aminobutyric acid receptor subunit alpha-2/beta-3/gamma-2
Type:
Mol. Mass.:
Description:
ASSAY_ID of ChEMBL is 2148174
Components:
This complex has 3 components.
Component 1
Name:
Gamma-aminobutyric acid receptor subunit gamma-2
Synonyms:
GABA(A) receptor subunit gamma-2 GBRG2_HUMAN
Type:
PROTEIN
Mol. Mass.:
54172.74
Organism:
Homo sapiens (Human)
Description:
EBI_217
Residue:
467
  
Component 2
Name:
Gamma-aminobutyric acid receptor subunit beta-3
Synonyms:
GABA A receptor alpha-4/beta-3/gamma-2 GABA-A receptor GBRB3_HUMAN | agonist GABA site
Type:
PROTEIN
Mol. Mass.:
54130.51
Organism:
Homo sapiens (Human)
Description:
ChEMBL_448071
Residue:
473
  
Component 3
Name:
Gamma-aminobutyric acid receptor subunit alpha-2
Synonyms:
GABA receptor alpha-2 subunit GBRA2_HUMAN | Gamma-aminobutyric acid receptor subunit alpha-2 (GABRA2)
Type:
Protein
Mol. Mass.:
51338.78
Organism:
Homo sapiens (Human)
Description:
P47869
Residue:
451
  
Inhibitor
Name:
BDBM50180004
Synonyms:
2-fluoro-5-(7-trifluoromethylimidazo[1,2-a]pyrimidin-3-yl)biphenyl-2-carbonitrile | CHEMBL381380
Type:
Small organic molecule
Emp. Form.:
C20H10F4N4
Mol. Mass.:
382.3138
SMILES:
Fc1ccc(cc1-c1ccccc1C#N)-c1cnc2nc(ccn12)C(F)(F)F
: