Target
3-oxoacyl-[acyl-carrier-protein] synthase 1
Ligand
BDBM50138281
Substrate
Meas. Tech.
ChEMBL_330089 (CHEMBL863311)
IC50
20000±n/a nM
Citation
 Kim, PZhang, YMShenoy, GNguyen, QABoshoff, HIManjunatha, UHGoodwin, MBLonsdale, JPrice, ACMiller, DJDuncan, KWhite, SWRock, COBarry, CEDowd, CS Structure-activity relationships at the 5-position of thiolactomycin: an intact (5R)-isoprene unit is required for activity against the condensing enzymes from Mycobacterium tuberculosis and Escherichia coli. J Med Chem 49:159-71 (2006)  
Target
Name:
3-oxoacyl-[acyl-carrier-protein] synthase 1
Synonyms:
FABB_ECOLI fabC
Type:
PROTEIN
Mol. Mass.:
42605.82
Organism:
Escherichia coli (strain K12)
Description:
ChEMBL_330089
Residue:
406
  
Inhibitor
Name:
BDBM50138281
Synonyms:
4-Hydroxy-3,5-dimethyl-5-((E)-2-methyl-buta-1,3-dienyl)-5H-thiophen-2-one CHEMBL322740 | rac-thiolactomycin
Type:
Small organic molecule
Emp. Form.:
C11H14O2S
Mol. Mass.:
210.293
SMILES:
CC1C(=O)SC(C)(\C=C(/C)C=C)C1=O
: