Target
3-oxoacyl-[acyl-carrier-protein] synthase 2
Ligand
BDBM50241313
Substrate
Meas. Tech.
ChEMBL_330092 (CHEMBL863390)
IC50
6000±n/a nM
Citation
 Kim, PZhang, YMShenoy, GNguyen, QABoshoff, HIManjunatha, UHGoodwin, MBLonsdale, JPrice, ACMiller, DJDuncan, KWhite, SWRock, COBarry, CEDowd, CS Structure-activity relationships at the 5-position of thiolactomycin: an intact (5R)-isoprene unit is required for activity against the condensing enzymes from Mycobacterium tuberculosis and Escherichia coli. J Med Chem 49:159-71 (2006)  
Target
Name:
3-oxoacyl-[acyl-carrier-protein] synthase 2
Synonyms:
KASB_MYCTU | kasB
Type:
PROTEIN
Mol. Mass.:
44268.74
Organism:
Mycobacterium tuberculosis
Description:
ChEMBL_330092
Residue:
417
  
Inhibitor
Name:
BDBM50241313
Synonyms:
(5R)-4-hydroxy-3,5-dimethyl-5-[(1E)-2-methylbuta-1,3-dienyl]thiophen-2(5H)-one (R)-4-Hydroxy-3,5-dimethyl-5-((E)-2-methyl-buta-1,3-dienyl)-5H-thiophen-2-one 5R-Thiolactomycin TLM analog, 1
Type:
Small organic molecule
Emp. Form.:
C11H14O2S
Mol. Mass.:
210.293
SMILES:
CC1C(=O)S[C@](C)(\C=C(/C)C=C)C1=O
: