Target
3-oxoacyl-[acyl-carrier-protein] synthase 3
Ligand
BDBM50180141
Substrate
Meas. Tech.
ChEMBL_330090 (CHEMBL863388)
IC50
100000±n/a nM
Citation
 Kim, PZhang, YMShenoy, GNguyen, QABoshoff, HIManjunatha, UHGoodwin, MBLonsdale, JPrice, ACMiller, DJDuncan, KWhite, SWRock, COBarry, CEDowd, CS Structure-activity relationships at the 5-position of thiolactomycin: an intact (5R)-isoprene unit is required for activity against the condensing enzymes from Mycobacterium tuberculosis and Escherichia coli. J Med Chem 49:159-71 (2006)  
Target
Name:
3-oxoacyl-[acyl-carrier-protein] synthase 3
Synonyms:
3-oxoacyl-[acyl-carrier-protein] synthase 3-oxoacyl-[acyl-carrier-protein] synthase III | Beta-ketoacyl-ACP synthase III (FabH)
Type:
Enzyme
Mol. Mass.:
33506.68
Organism:
Escherichia coli
Description:
C3TDZ2
Residue:
317
  
Inhibitor
Name:
BDBM50180141
Synonyms:
3,5-dimethyl-5-dodecyl-4-hydroxy-5H-thiophen-2-one | CHEMBL199542
Type:
Small organic molecule
Emp. Form.:
C18H32O2S
Mol. Mass.:
312.51
SMILES:
CCCCCCCCCCCCC1(C)SC(=O)C(C)C1=O
: