Target
Aurora kinase A
Ligand
BDBM50181549
Substrate
Meas. Tech.
ChEMBL_420088 (CHEMBL873731)
IC50
483±n/a nM
Citation
 Jung, FHPasquet, GLambert-van der Brempt, CLohmann, JJWarin, NRenaud, FGermain, HDe Savi, CRoberts, NJohnson, TDousson, CHill, GBMortlock, AAHeron, NWilkinson, RWWedge, SRHeaton, SPOdedra, RKeen, NJGreen, SBrown, EThompson, KBrightwell, S Discovery of novel and potent thiazoloquinazolines as selective Aurora A and B kinase inhibitors. J Med Chem 49:955-70 (2006)  
Target
Name:
Aurora kinase A
Synonyms:
AIK ARK1 AURKA AYK1 Aurora kinase A (AURA) Aurora kinase A (Aurora A) Aurora-related kinase 1 BTAK Breast-tumor-amplified kinase STK15 Serine/threonine kinase 15 Serine/threonine-protein kinase aurora A hARK1
Type:
Serine/threonine-protein kinase
Mol. Mass.:
45830.98
Organism:
Homo sapiens (Human)
Description:
O14965
Residue:
403
  
Inhibitor
Name:
BDBM50181549
Synonyms:
CHEMBL203422 | N-[3-(dimethylamino)phenyl]-2-{2-[(7-{3-[(2S)-2-(hydroxymethyl)pyrrolidin-1-yl]propoxy}-6-methoxyquinazolin-4-yl)amino]-1,3-thiazol-5-yl}acetamide
Type:
Small organic molecule
Emp. Form.:
C30H37N7O4S
Mol. Mass.:
591.724
SMILES:
COc1cc2c(Nc3ncc(CC(=O)Nc4cccc(c4)N(C)C)s3)ncnc2cc1OCCCN1CCC[C@H]1CO
: