Target
Sodium-dependent serotonin transporter
Ligand
BDBM50176259
Substrate
Meas. Tech.
ChEMBL_333145 (CHEMBL865913)
IC50
4300±n/a nM
Citation
 Shao, LAbolin, CHewitt, MCKoch, PVarney, M Derivatives of tramadol for increased duration of effect. Bioorg Med Chem Lett 16:691-4 (2005)  
Target
Name:
Sodium-dependent serotonin transporter
Synonyms:
5-HT Transporter 5HTT SC6A4_HUMAN SLC6A4 Serotonin transporter (5HTT) Sodium-dependent serotonin transporter (SERT) | Solute carrier family 6 member 4
Type:
Multi-pass membrane protein
Mol. Mass.:
70322.51
Organism:
Homo sapiens (Human)
Description:
P31645
Residue:
630
  
Inhibitor
Name:
BDBM50176259
Synonyms:
(1R,2R)-2-[(dimethylamino)methyl]-1-(3-methoxyphenyl)cyclohexanol TRAMADOL
Type:
Small organic molecule
Emp. Form.:
C16H25NO2
Mol. Mass.:
263.3752
SMILES:
COc1cccc(c1)[C@@]1(O)CCCC[C@@H]1CN(C)C
: