Target
Cannabinoid receptor 1
Ligand
BDBM50181832
Substrate
Meas. Tech.
ChEMBL_333218 (CHEMBL858976)
Ki
>10000±n/a nM
Citation
 Ben-Shabat, SHanus, LOKatzavian, GGallily, R New cannabidiol derivatives: synthesis, binding to cannabinoid receptor, and evaluation of their antiinflammatory activity. J Med Chem 49:1113-7 (2006)  
Target
Name:
Cannabinoid receptor 1
Synonyms:
Brain-type cannabinoid receptor CB-R CNR1_RAT Cannabinoid receptor Cnr1 | Skr6
Type:
G Protein-Coupled Receptor (GPCR)
Mol. Mass.:
52856.55
Organism:
Rattus norvegicus (rat)
Description:
P20272
Residue:
473
  
Inhibitor
Name:
BDBM50181832
Synonyms:
2-((6R)-3-methyl-6-(prop-1-en-2-yl)cyclohex-2-enyl)-5-(2-methyloctan-2-yl)benzene-1,3-diol | CHEMBL202146
Type:
Small organic molecule
Emp. Form.:
C25H38O2
Mol. Mass.:
370.568
SMILES:
CCCCCCC(C)(C)c1cc(O)c(C2C=C(C)CC[C@H]2C(C)=C)c(O)c1
: