Target
DNA polymerase III PolC-type
Ligand
BDBM50182669
Substrate
Meas. Tech.
ChEMBL_334242 (CHEMBL861887)
Ki
4±n/a nM
Citation
 Zhi, CLong, ZYManikowski, AComstock, JXu, WCBrown, NCTarantino, PMHolm, KADix, EJWright, GEBarnes, MHButler, MMFoster, KALaMarr, WABachand, BBethell, RCadilhac, CCharron, SLamothe, SMotorina, IStorer, R Hybrid antibacterials. DNA polymerase-topoisomerase inhibitors. J Med Chem 49:1455-65 (2006)  
Target
Name:
DNA polymerase III PolC-type
Synonyms:
DNA polymerase III DNA-directed DNA polymerase PolIII mutI | polC
Type:
Enzyme
Mol. Mass.:
162625.67
Organism:
Bacillus subtilis
Description:
Enzyme was purified from recombinant strains.
Residue:
1437
  
Inhibitor
Name:
BDBM50182669
Synonyms:
(S)-3-{4-[1-(1-cyclopropyl-3-carboxy-4-oxo-6,8-difluoro-7-quinolyl)-4-(3-methylpiperazinyl)]butyl}-6-(3-ethyl-4-methylanilino)uracil | CHEMBL381636
Type:
Small organic molecule
Emp. Form.:
C35H40F2N6O5
Mol. Mass.:
662.7261
SMILES:
CCc1cc(Nc2cc(=O)n(CCCCN3CCN(C[C@@H]3C)c3c(F)cc4c(c3F)n(cc(C(O)=O)c4=O)C3CC3)c(=O)[nH]2)ccc1C
: