Target
Coagulation factor VII/Tissue factor
Ligand
BDBM50177203
Substrate
Meas. Tech.
ChEMBL_334641 (CHEMBL854110)
IC50
97±n/a nM
Citation
 Kohrt, JTFilipski, KJCody, WLCai, CDudley, DAVan Huis, CAWillardsen, JANarasimhan, LSZhang, ERapundalo, STSaiya-Cork, KLeadley, RJEdmunds, JJ The discovery of fluoropyridine-based inhibitors of the factor VIIa/TF complex--Part 2. Bioorg Med Chem Lett 16:1060-4 (2006)  
Target
Name:
Coagulation factor VII/Tissue factor
Synonyms:
Coagulation factor III/Factor VIIa (fVIIa) | Coagulation factor III/VII
Type:
Mol. Mass.:
Description:
ASSAY_ID of EBI is 69535
Components:
This complex has 2 components.
Component 1
Name:
Tissue factor
Synonyms:
CD_antigen=CD142 Coagulation factor VII/tissue factor TF Thromboplastin | Tissue factor
Type:
PROTEIN
Mol. Mass.:
33067.61
Organism:
Homo sapiens (Human)
Description:
ChEMBL_936735
Residue:
295
  
Component 2
Name:
Coagulation factor VII
Synonyms:
Eptacog alfa FA7_HUMAN Factor VIIa (fVIIa) SPCA serum prothrombin conversion accelerator
Type:
Enzyme
Mol. Mass.:
51599.89
Organism:
Homo sapiens (Human)
Description:
Residue:
466
  
Inhibitor
Name:
BDBM50177203
Synonyms:
2-[6-(3-Carbamimidoyl-phenoxy)-4-diisopropylamino-3,5-difluoro-pyridin-2-yloxy]-5-pyridin-2-yl-benzoic acid trifluoro-acetic acid | CHEMBL383717
Type:
Small organic molecule
Emp. Form.:
C30H29F2N5O4
Mol. Mass.:
561.5792
SMILES:
CC(C)N(C(C)C)c1c(F)c(Oc2cccc(c2)C(N)=N)nc(Oc2ccc(cc2C(O)=O)-c2ccccn2)c1F
: