Target
Delta-type opioid receptor
Ligand
BDBM50183556
Substrate
Meas. Tech.
ChEMBL_335168 (CHEMBL861290)
EC50
0.52±n/a nM
Citation
 Lee, YSAgnes, RSBadghisi, HDavis, PMa, SWLai, JPorreca, FHruby, VJ Design and synthesis of novel hydrazide-linked bifunctional peptides as delta/mu opioid receptor agonists and CCK-1/CCK-2 receptor antagonists. J Med Chem 49:1773-80 (2006)  
Target
Name:
Delta-type opioid receptor
Synonyms:
D-OR-1 Delta opioid receptor OPIATE Delta OPRD1 OPRK1 | opioid receptor, delta 1
Type:
G Protein-Coupled Receptor (GPCR)
Mol. Mass.:
40382.98
Organism:
Homo sapiens (Human)
Description:
Competition binding assays were carried out using membrane preparations from transfected HN9.10 cells that constitutively expressed the delta opioid receptor.
Residue:
372
  
Inhibitor
Name:
BDBM50183556
Synonyms:
CHEMBL408889 | H-Tyr-D-Ala-Gly-Phe-NH-NH-(NMe)Phe-Asp-Nle-Trp-Ac
Type:
Small organic molecule
Emp. Form.:
C56H67N9O14
Mol. Mass.:
1090.1831
SMILES:
CCCC[C@H](NC(=O)[C@H](CC(O)=O)NC(=O)[C@H](Cc1ccccc1)N(C)N[C@@H](Cc1ccccc1)C(=O)NCC(=O)N[C@H](C)C(=O)N[C@@H](Cc1ccc(O)cc1)C(O)=O)C(=O)N[C@@H](Cc1cn(C(C)=O)c2ccccc12)C(O)=O
: