Target
Delta-type opioid receptor
Ligand
BDBM50183552
Substrate
Meas. Tech.
ChEMBL_335170 (CHEMBL861292)
IC50
26±n/a nM
Citation
 Lee, YSAgnes, RSBadghisi, HDavis, PMa, SWLai, JPorreca, FHruby, VJ Design and synthesis of novel hydrazide-linked bifunctional peptides as delta/mu opioid receptor agonists and CCK-1/CCK-2 receptor antagonists. J Med Chem 49:1773-80 (2006)  
Target
Name:
Delta-type opioid receptor
Synonyms:
DOR-1 MSL-2 OPRD_MOUSE Oprd1
Type:
Enzyme Catalytic Domain
Mol. Mass.:
40577.25
Organism:
MOUSE
Description:
P32300
Residue:
372
  
Inhibitor
Name:
BDBM50183552
Synonyms:
CHEMBL412331 | H-Tyr-D-Ala-Gly-Phe-NH-NH-(NMe)Phe-Asp-Lys(Cpac)-Trp-Ac
Type:
Small organic molecule
Emp. Form.:
C63H71ClN10O15
Mol. Mass.:
1243.749
SMILES:
CCCC[C@H](N(C(=O)Nc1ccccc1Cl)C(=O)[C@H](CC(O)=O)NC(=O)[C@H](Cc1ccccc1)N(C)N[C@@H](Cc1ccccc1)C(=O)NCC(=O)N[C@H](C)C(=O)N[C@@H](Cc1ccc(O)cc1)C(O)=O)C(=O)N[C@@H](Cc1cn(C(C)=O)c2ccccc12)C(O)=O
: