Target
Cytoplasmic dynein 1 heavy chain 1
Ligand
BDBM50184425
Substrate
Meas. Tech.
ChEMBL_338931 (CHEMBL860724)
IC50
35000±n/a nM
Citation
 Zhu, GYang, FBalachandran, RHöök, PVallee, RBCurran, DPDay, BW Synthesis and biological evaluation of purealin and analogues as cytoplasmic dynein heavy chain inhibitors. J Med Chem 49:2063-76 (2006)  
Target
Name:
Cytoplasmic dynein 1 heavy chain 1
Synonyms:
Cytoplasmic dynein 1 heavy chain 1 DYHC1_RAT Dnch1 Dnec1 Dync1h1 Dynein heavy chain, cytosolic Map1c
Type:
PROTEIN
Mol. Mass.:
532238.31
Organism:
Rattus norvegicus
Description:
ChEMBL_338931
Residue:
4644
  
Inhibitor
Name:
BDBM50184425
Synonyms:
CHEMBL206161 | Purealin
Type:
Small organic molecule
Emp. Form.:
C27H29Br4N7O7
Mol. Mass.:
883.178
SMILES:
COC1=C(Br)[C@@H](O)[C@@]2(CC(=NO2)C(=O)NCCCOc2c(Br)cc(CC(N=O)C(=O)NCCc3cnc(N)[nH]3)cc2Br)C=C1Br
: