Target
Gamma-aminobutyric acid receptor subunit alpha-2/beta-2/gamma-2
Ligand
BDBM50370710
Substrate
Meas. Tech.
ChEMBL_343683 (CHEMBL861093)
Ki
155±n/a nM
Citation
 Primofiore, GDa Settimo, FMarini, AMTaliani, SLa Motta, CSimorini, FNovellino, EGreco, GCosimelli, BEhlardo, MSala, ABesnard, FMontali, MMartini, C Refinement of the benzodiazepine receptor site topology by structure-activity relationships of new N-(heteroarylmethyl)indol-3-ylglyoxylamides. J Med Chem 49:2489-95 (2006)  
Target
Name:
Gamma-aminobutyric acid receptor subunit alpha-2/beta-2/gamma-2
Synonyms:
GABA receptor alpha-2/beta-2/gamma-2 subunit
Type:
Mol. Mass.:
Description:
ASSAY_ID of EBI is 37810
Components:
This complex has 3 components.
Component 1
Name:
Gamma-aminobutyric acid receptor subunit beta-2
Synonyms:
GBRB2_RAT Gabrb2 | Gamma-aminobutyric acid receptor subunit beta-2 (GABA(A) beta-2)
Type:
Enzyme
Mol. Mass.:
54648.97
Organism:
Rattus norvegicus (Rat)
Description:
P63138
Residue:
474
  
Component 2
Name:
Gamma-aminobutyric acid receptor subunit gamma-2
Synonyms:
GBRG2_RAT Gamma-aminobutyric acid receptor subunit gamma-2 (GABA(A) gamma-2)
Type:
Enzyme
Mol. Mass.:
54087.63
Organism:
Rattus norvegicus (Rat)
Description:
P18508
Residue:
466
  
Component 3
Name:
Gamma-aminobutyric acid receptor subunit alpha-2
Synonyms:
GABA A Alpha2Beta2Gamma2 GABA A receptor alpha-2/beta-2/gamma-2 GABA(A) receptor subunit alpha-2 Gabra-2 Gamma-aminobutyric acid receptor subunit alpha-2
Type:
Enzyme
Mol. Mass.:
51195.57
Organism:
Rattus norvegicus (Rat)
Description:
P23576
Residue:
451
  
Inhibitor
Name:
BDBM50370710
Synonyms:
CHEMBL1162923
Type:
Small organic molecule
Emp. Form.:
C15H11N3O5
Mol. Mass.:
313.2649
SMILES:
[O-][N+](=O)c1ccc2[nH]cc(C(=O)C(=O)NCc3ccco3)c2c1
: