Target
Carbonic anhydrase
Ligand
BDBM10860
Substrate
Meas. Tech.
ChEMBL_347177 (CHEMBL862664)
Ki
830±n/a nM
Citation
 Nishimori, IVullo, DMinakuchi, TMorimoto, KOnishi, SScozzafava, ASupuran, CT Carbonic anhydrase inhibitors: cloning and sulfonamide inhibition studies of a carboxyterminal truncated alpha-carbonic anhydrase from Helicobacter pylori. Bioorg Med Chem Lett 16:2182-8 (2006)  
Target
Name:
Carbonic anhydrase
Synonyms:
Beta-carbonic anhydrase Carbonic anhydrase 1 hpβCA
Type:
Protein
Mol. Mass.:
25517.77
Organism:
Helicobacter pylori (strain G27)
Description:
O24855
Residue:
221
  
Inhibitor
Name:
BDBM10860
Synonyms:
4-(aminomethyl)benzene-1-sulfonamide MAFENIDE aromatic/heteroaromatic sulfonamide 5 | hCA inhibitor, 9
Type:
Small organic molecule
Emp. Form.:
C7H10N2O2S
Mol. Mass.:
186.232
SMILES:
NCc1ccc(cc1)S(N)(=O)=O
: