Target
Voltage-dependent calcium channel alpha-2 delta subunit
Ligand
BDBM50168500
Substrate
Meas. Tech.
ChEMBL_348644 (CHEMBL866258)
IC50
>10000±n/a nM
Citation
 Burgos-Lepley, CEThompson, LRKneen, COOsborne, SABryans, JSCapiris, TSuman-Chauhan, NDooley, DJDonovan, CMField, MJVartanian, MGKinsora, JJLotarski, SMEl-Kattan, AWalters, KCherukury, MTaylor, CPWustrow, DJSchwarz, JB Carboxylate bioisosteres of gabapentin. Bioorg Med Chem Lett 16:2333-6 (2006)  
Target
Name:
Voltage-dependent calcium channel alpha-2 delta subunit
Synonyms:
Voltage-dependent calcium channel alpha2delta subunit
Type:
PROTEIN
Mol. Mass.:
123127.66
Organism:
Sus scrofa
Description:
ChEMBL_605546
Residue:
1091
  
Inhibitor
Name:
BDBM50168500
Synonyms:
(1-(aminomethyl)cyclohexyl)methanesulfinic acid | CHEMBL383296
Type:
Small organic molecule
Emp. Form.:
C8H17NO2S
Mol. Mass.:
191.291
SMILES:
NCC1(CS(O)=O)CCCCC1
: