Target
Voltage-dependent calcium channel subunit alpha-2/delta-1
Ligand
BDBM50168499
Substrate
Meas. Tech.
ChEMBL_348646 (CHEMBL866255)
IC50
5700±n/a nM
Citation
 Burgos-Lepley, CEThompson, LRKneen, COOsborne, SABryans, JSCapiris, TSuman-Chauhan, NDooley, DJDonovan, CMField, MJVartanian, MGKinsora, JJLotarski, SMEl-Kattan, AWalters, KCherukury, MTaylor, CPWustrow, DJSchwarz, JB Carboxylate bioisosteres of gabapentin. Bioorg Med Chem Lett 16:2333-6 (2006)  
Target
Name:
Voltage-dependent calcium channel subunit alpha-2/delta-1
Synonyms:
CA2D1_RAT Cacnl2a Voltage-gated calcium channel alpha2/delta subunit 1
Type:
PROTEIN
Mol. Mass.:
123802.11
Organism:
Rattus norvegicus
Description:
ChEMBL_348646
Residue:
1091
  
Inhibitor
Name:
BDBM50168499
Synonyms:
(1-((1H-tetrazol-5-yl)methyl)cycloheptyl)methanamine | CHEMBL378552
Type:
Small organic molecule
Emp. Form.:
C10H19N5
Mol. Mass.:
209.2914
SMILES:
NCC1(Cc2nnn[nH]2)CCCCCC1
: