Target
Breakpoint cluster region protein/Tyrosine-protein kinase ABL1
Ligand
BDBM50186763
Substrate
Meas. Tech.
ChEMBL_353614 (CHEMBL861701)
IC50
6000±n/a nM
Citation
 Roberti, MPizzirani, DRecanatini, MSimoni, DGrimaudo, SDi Cristina, AAbbadessa, VGebbia, NTolomeo, M Identification of a terphenyl derivative that blocks the cell cycle in the G0-G1 phase and induces differentiation in leukemia cells. J Med Chem 49:3012-8 (2006)  
Target
Name:
Breakpoint cluster region protein/Tyrosine-protein kinase ABL1
Synonyms:
Bcr-Abl Breakpoint cluster region protein /Tyrosine-protein kinase ABL | Tyrosine-protein kinase ABL1/Breakpoint cluster region protein
Type:
Enzyme
Mol. Mass.:
Description:
Components:
This complex has 2 components.
Component 1
Name:
Tyrosine-protein kinase ABL1
Synonyms:
ABL ABL1_HUMAN JTK7 Proto-oncogene tyrosine-protein kinase ABL1 Tyrosine-protein kinase ABL V-abl Abelson murine leukemia viral oncogene homolog 1 p150 | tyrosine-protein kinase ABL1 isoform a
Type:
Enzyme
Mol. Mass.:
122897.30
Organism:
Homo sapiens (Human)
Description:
P00519
Residue:
1130
  
Component 2
Name:
Breakpoint cluster region protein
Synonyms:
BCR BCR_HUMAN Breakpoint cluster region protein | D22S11
Type:
PROTEIN
Mol. Mass.:
142824.75
Organism:
Homo sapiens (Human)
Description:
ChEMBL_305348
Residue:
1271
  
Inhibitor
Name:
BDBM50186763
Synonyms:
4,3'',5''-trimethoxy-[1,1';2',1'']-terphenyl | CHEMBL379687
Type:
Small organic molecule
Emp. Form.:
C21H20O3
Mol. Mass.:
320.3817
SMILES:
COc1ccc(cc1)-c1ccccc1-c1cc(OC)cc(OC)c1
: