Target
Prothrombin
Ligand
BDBM50183878
Substrate
Meas. Tech.
ChEBML_354126
IC50
9.9±n/a nM
Citation
 Mack, HBaucke, DHornberger, WLange, UESeitz, WHöffken, HW Orally active thrombin inhibitors. Part 1: optimization of the P1-moiety. Bioorg Med Chem Lett 16:2641-7 (2006)  
Target
Name:
Prothrombin
Synonyms:
Activation peptide fragment 1 Coagulation factor II Prothrombin precursor Thrombin heavy chain | Thrombin light chain
Type:
Protein
Mol. Mass.:
70029.57
Organism:
Homo sapiens (Human)
Description:
P00734
Residue:
622
  
Inhibitor
Name:
BDBM50183878
Synonyms:
((R)-2-{(S)-2-[(4-carbamimidoyl-3-methyl-thiophen-2-ylmethyl)-carbamoyl]-2,5-dihydro-pyrrol-1-yl}-1-cyclohexylmethyl-2-oxo-ethylamino)-acetic acid | CHEMBL427037
Type:
Small organic molecule
Emp. Form.:
C23H33N5O4S
Mol. Mass.:
475.604
SMILES:
Cc1c(CNC(=O)[C@@H]2C=CCN2C(=O)[C@@H](CC2CCCCC2)NCC(O)=O)scc1C(N)=N
: