Target
Prothrombin
Ligand
BDBM29388
Substrate
Meas. Tech.
ChEMBL_354267 (CHEMBL870018)
IC50
69.2±n/a nM
Citation
 Lange, UEBaucke, DHornberger, WMack, HSeitz, WHöffken, HW Orally active thrombin inhibitors. Part 2: optimization of the P2-moiety. Bioorg Med Chem Lett 16:2648-53 (2006)  
Target
Name:
Prothrombin
Synonyms:
Activation peptide fragment 1 Coagulation factor II Prothrombin precursor Thrombin heavy chain | Thrombin light chain
Type:
Protein
Mol. Mass.:
70029.57
Organism:
Homo sapiens (Human)
Description:
P00734
Residue:
622
  
Inhibitor
Name:
BDBM29388
Synonyms:
Exanta US11584714, Compound 999
Type:
Small organic molecule
Emp. Form.:
C22H31N5O4
Mol. Mass.:
429.5126
SMILES:
NC(=N)c1ccc(CNC(=O)[C@@H]2CCN2C(=O)[C@H](NCC(O)=O)C2CCCCC2)cc1
: