Target
Prothrombin
Ligand
BDBM50182196
Substrate
Meas. Tech.
ChEMBL_354267 (CHEMBL870018)
IC50
1.7±n/a nM
Citation
 Lange, UEBaucke, DHornberger, WMack, HSeitz, WHöffken, HW Orally active thrombin inhibitors. Part 2: optimization of the P2-moiety. Bioorg Med Chem Lett 16:2648-53 (2006)  
Target
Name:
Prothrombin
Synonyms:
Activation peptide fragment 1 Coagulation factor II Prothrombin precursor Thrombin heavy chain | Thrombin light chain
Type:
Protein
Mol. Mass.:
70029.57
Organism:
Homo sapiens (Human)
Description:
P00734
Residue:
622
  
Inhibitor
Name:
BDBM50182196
Synonyms:
((R)-2-{(S)-5-[(6-carbamimidoyl-pyridin-3-ylmethyl)-carbamoyl]-4,5-dihydro-3H-pyrazol-1-yl}-1-cyclohexylmethyl-2-oxo-ethylamino)-acetic acid | CHEMBL377972
Type:
Small organic molecule
Emp. Form.:
C22H32N7O4
Mol. Mass.:
458.5334
SMILES:
NC(=N)c1ccc(CNC(=O)C2=[N+](NCC2)C(=O)[C@@H](CC2CCCCC2)NCC(O)=O)cn1
: