Target
Growth hormone secretagogue receptor type 1
Ligand
BDBM50187316
Substrate
Meas. Tech.
ChEMBL_357594 (CHEMBL871314)
EC50
0.6±n/a nM
Citation
 Pedretti, AVilla, MPallavicini, MValoti, EVistoli, G Construction of human ghrelin receptor (hGHS-R1a) model using a fragmental prediction approach and validation through docking analysis. J Med Chem 49:3077-85 (2006)  
Target
Name:
Growth hormone secretagogue receptor type 1
Synonyms:
GH-releasing peptide receptor GHS-R GHSR_HUMAN Ghrelin receptor | Ghrelin receptor 1a (GHS-R1a)
Type:
Receptor
Mol. Mass.:
41334.57
Organism:
Homo sapiens (Human)
Description:
Receptor binding studies use plasma membranes from LLC PK-1 cells transiently transfected with hGHSR1a.
Residue:
366
  
Inhibitor
Name:
BDBM50187316
Synonyms:
1-{[(2R)-1-[(3R)-3-hydroxy-2,3-dihydrospiro[indene-1,4'-piperidine]-1'-yl]-3-(1H-indol-3-yl)-1-oxopropan-2-yl]carbamoyl}-1-methylethan-1-aminium
Type:
Small organic molecule
Emp. Form.:
C28H35N4O3
Mol. Mass.:
475.602
SMILES:
CC(C)([NH3+])C(=O)N[C@H](Cc1c[nH]c2ccccc12)C(=O)N1CCC2(C[C@@H](O)c3ccccc23)CC1
: