Target
3-oxoacyl-acyl-carrier protein reductase
Ligand
BDBM7462
Substrate
Meas. Tech.
ChEMBL_361105 (CHEMBL859171)
IC50
4000±n/a nM
Citation
 Tasdemir, DLack, GBrun, RRüedi, PScapozza, LPerozzo, R Inhibition of Plasmodium falciparum fatty acid biosynthesis: evaluation of FabG, FabZ, and FabI as drug targets for flavonoids. J Med Chem 49:3345-53 (2006)  
Target
Name:
3-oxoacyl-acyl-carrier protein reductase
Synonyms:
Type:
PROTEIN
Mol. Mass.:
33333.53
Organism:
Plasmodium falciparum
Description:
ChEMBL_675156
Residue:
301
  
Inhibitor
Name:
BDBM7462
Synonyms:
3,5,7-trihydroxy-2-(4-hydroxyphenyl)-4H-chromen-4-one CHEMBL150 Kaempferol (Kmp) kaempferol
Type:
Small organic molecule
Emp. Form.:
C15H10O6
Mol. Mass.:
286.2363
SMILES:
Oc1ccc(cc1)-c1oc2cc(O)cc(O)c2c(=O)c1O
: