Target
Acetyl-CoA carboxylase 2
Ligand
BDBM50189632
Substrate
Meas. Tech.
ChEMBL_368469 (CHEMBL867453)
IC50
>30000±n/a nM
Citation
 Gu, YGWeitzberg, MClark, RFXu, XLi, QZhang, THansen, TMLiu, GXin, ZWang, XWang, RMcNally, TZinker, BAFrevert, EUCamp, HSCamp, HBeutel, BASham, HL Synthesis and structure-activity relationships of N-{3-[2-(4-alkoxyphenoxy)thiazol-5-yl]-1- methylprop-2-ynyl}carboxy derivatives as selective acetyl-CoA carboxylase 2 inhibitors. J Med Chem 49:3770-3 (2006)  
Target
Name:
Acetyl-CoA carboxylase 2
Synonyms:
ACACB ACC-beta ACCB Acetyl-CoA carboxylase 2 Acetyl-CoA carboxylase 2 (ACC2)
Type:
Protein
Mol. Mass.:
276535.21
Organism:
Homo sapiens (Human)
Description:
O00763
Residue:
2458
  
Inhibitor
Name:
BDBM50189632
Synonyms:
CHEMBL408331 | N-{3-[2-(4-isopropyl-phenoxy)-thiazol-5-yl]-1-methyl-prop-2-ynyl}-acetamide
Type:
Small organic molecule
Emp. Form.:
C18H20N2O2S
Mol. Mass.:
328.429
SMILES:
CC(NC(C)=O)C#Cc1cnc(Oc2ccc(cc2)C(C)C)s1
: