Target
Delta-type opioid receptor
Ligand
BDBM50190359
Substrate
Meas. Tech.
ChEMBL_376241 (CHEMBL869294)
Ki
480±n/a nM
Citation
 Zhang, QKeenan, SMPeng, YNair, ACYu, SJHowells, RDWelsh, WJ Discovery of novel triazole-based opioid receptor antagonists. J Med Chem 49:4044-7 (2006)  
Target
Name:
Delta-type opioid receptor
Synonyms:
D-OR-1 Delta opioid receptor OPIATE Delta OPRD1 OPRK1 | opioid receptor, delta 1
Type:
G Protein-Coupled Receptor (GPCR)
Mol. Mass.:
40382.98
Organism:
Homo sapiens (Human)
Description:
Competition binding assays were carried out using membrane preparations from transfected HN9.10 cells that constitutively expressed the delta opioid receptor.
Residue:
372
  
Inhibitor
Name:
BDBM50190359
Synonyms:
1-[(3-naphthalen-2-yl)-5-N,N-dimethylamino-(1,2,4-triazol-4-yl) ]-3-phenol | CHEMBL377643
Type:
Small organic molecule
Emp. Form.:
C20H18N4O
Mol. Mass.:
330.3831
SMILES:
CN(C)c1nnc(-c2ccc3ccccc3c2)n1-c1cccc(O)c1
: