Target
Delta-type opioid receptor
Ligand
BDBM50190361
Substrate
Meas. Tech.
ChEMBL_376241 (CHEMBL869294)
Ki
150±n/a nM
Citation
 Zhang, QKeenan, SMPeng, YNair, ACYu, SJHowells, RDWelsh, WJ Discovery of novel triazole-based opioid receptor antagonists. J Med Chem 49:4044-7 (2006)  
Target
Name:
Delta-type opioid receptor
Synonyms:
D-OR-1 Delta opioid receptor OPIATE Delta OPRD1 OPRK1 | opioid receptor, delta 1
Type:
G Protein-Coupled Receptor (GPCR)
Mol. Mass.:
40382.98
Organism:
Homo sapiens (Human)
Description:
Competition binding assays were carried out using membrane preparations from transfected HN9.10 cells that constitutively expressed the delta opioid receptor.
Residue:
372
  
Inhibitor
Name:
BDBM50190361
Synonyms:
1-[3-(3-biphenyl)-5-N,N-dimethylamino-(1,2,4-triazol-4-yl) ]-3-phenol | CHEMBL209152
Type:
Small organic molecule
Emp. Form.:
C22H20N4O
Mol. Mass.:
356.4204
SMILES:
CN(C)c1nnc(-c2cccc(c2)-c2ccccc2)n1-c1cccc(O)c1
: