Target
Mu-type opioid receptor
Ligand
BDBM50190366
Substrate
Meas. Tech.
ChEMBL_376242 (CHEMBL869296)
Ki
>10000±n/a nM
Citation
 Zhang, QKeenan, SMPeng, YNair, ACYu, SJHowells, RDWelsh, WJ Discovery of novel triazole-based opioid receptor antagonists. J Med Chem 49:4044-7 (2006)  
Target
Name:
Mu-type opioid receptor
Synonyms:
M-OR-1 MOR-1 MUOR1 Mu opiate receptor OPRM1 hMOP | mu-type opioid receptor isoform MOR-1
Type:
G Protein-Coupled Receptor (GPCR)
Mol. Mass.:
44789.51
Organism:
Homo sapiens (Human)
Description:
P35372
Residue:
400
  
Inhibitor
Name:
BDBM50190366
Synonyms:
1-{3-[4-(tert-butyl)phenyl]-5-N,N-dimethylamino-(1,2,4-triazol-4-yl)}-3-methoxybenzene | CHEMBL211673
Type:
Small organic molecule
Emp. Form.:
C21H26N4O
Mol. Mass.:
350.4573
SMILES:
COc1cccc(c1)-n1c(nnc1-c1ccc(cc1)C(C)(C)C)N(C)C
: