Target
Kappa-type opioid receptor
Ligand
BDBM50190373
Substrate
Meas. Tech.
ChEMBL_376243 (CHEMBL869298)
Ki
>10000±n/a nM
Citation
 Zhang, QKeenan, SMPeng, YNair, ACYu, SJHowells, RDWelsh, WJ Discovery of novel triazole-based opioid receptor antagonists. J Med Chem 49:4044-7 (2006)  
Target
Name:
Kappa-type opioid receptor
Synonyms:
K-OR-1 Kappa-opioid receptor (KOR) Kappa-type opioid receptor (KOR) OPIATE Kappa OPRK1 kappa opioid receptor (KOR)
Type:
G Protein-Coupled Receptor (GPCR)
Mol. Mass.:
42648.76
Organism:
Homo sapiens (Human)
Description:
P41145
Residue:
380
  
Inhibitor
Name:
BDBM50190373
Synonyms:
1-[3-(4-biphenyl)-(1,2,4-triazol-4-yl) ]-3-phenol | CHEMBL208801
Type:
Small organic molecule
Emp. Form.:
C20H15N3O
Mol. Mass.:
313.3526
SMILES:
Oc1cccc(c1)-n1cnnc1-c1ccc(cc1)-c1ccccc1
: