Target
Nociceptin receptor
Ligand
BDBM50189250
Substrate
Meas. Tech.
ChEMBL_378705 (CHEMBL853453)
Ki
400±n/a nM
Citation
 Crooks, PAKottayil, SGAl-Ghananeem, AMByrn, SRButterfield, DA Opiate receptor binding properties of morphine-, dihydromorphine-, and codeine 6-O-sulfate ester congeners. Bioorg Med Chem Lett 16:4291-5 (2006)  
Target
Name:
Nociceptin receptor
Synonyms:
OOR OPRX_CAVPO
Type:
PROTEIN
Mol. Mass.:
40796.89
Organism:
Cavia porcellus
Description:
ChEMBL_444577
Residue:
370
  
Inhibitor
Name:
BDBM50189250
Synonyms:
CHEMBL379928 | MM3A6S
Type:
Small organic molecule
Emp. Form.:
C20H23NO7S
Mol. Mass.:
421.464
SMILES:
CC(=O)Oc1ccc2C[C@@H]3[C@@H]4C=C[C@H](OS([O-])(=O)=O)[C@@H]5Oc1c2[C@]45CC[N+]3(C)C
: