Target
Delta-type opioid receptor
Ligand
BDBM50189249
Substrate
Meas. Tech.
ChEMBL_378703 (CHEMBL853451)
Ki
584±n/a nM
Citation
 Crooks, PAKottayil, SGAl-Ghananeem, AMByrn, SRButterfield, DA Opiate receptor binding properties of morphine-, dihydromorphine-, and codeine 6-O-sulfate ester congeners. Bioorg Med Chem Lett 16:4291-5 (2006)  
Target
Name:
Delta-type opioid receptor
Synonyms:
D-OR-1 Delta opioid receptor OPIATE Delta OPRD1 OPRK1 | opioid receptor, delta 1
Type:
G Protein-Coupled Receptor (GPCR)
Mol. Mass.:
40382.98
Organism:
Homo sapiens (Human)
Description:
Competition binding assays were carried out using membrane preparations from transfected HN9.10 cells that constitutively expressed the delta opioid receptor.
Residue:
372
  
Inhibitor
Name:
BDBM50189249
Synonyms:
CHEMBL211576 | M3IBu6S
Type:
Small organic molecule
Emp. Form.:
C21H25NO7S
Mol. Mass.:
435.491
SMILES:
CC(C)C(=O)Oc1ccc2C[C@@H]3[C@@H]4C=C[C@H](OS([O-])(=O)=O)[C@@H]5Oc1c2[C@]45CC[NH+]3C
: