Target
Mu-type opioid receptor
Ligand
BDBM50189245
Substrate
Meas. Tech.
ChEMBL_378702 (CHEMBL853450)
Ki
196±n/a nM
Citation
 Crooks, PAKottayil, SGAl-Ghananeem, AMByrn, SRButterfield, DA Opiate receptor binding properties of morphine-, dihydromorphine-, and codeine 6-O-sulfate ester congeners. Bioorg Med Chem Lett 16:4291-5 (2006)  
Target
Name:
Mu-type opioid receptor
Synonyms:
M-OR-1 Mu opioid receptor OPIATE Mu OPRM_CAVPO
Type:
Enzyme Catalytic Domain
Mol. Mass.:
11165.58
Organism:
GUINEA PIG
Description:
P97266
Residue:
98
  
Inhibitor
Name:
BDBM50189245
Synonyms:
CHEMBL1416 | DC6S
Type:
Small organic molecule
Emp. Form.:
C18H23NO6S
Mol. Mass.:
381.443
SMILES:
COc1ccc2C[C@@H]3[C@@H]4CC[C@H](OS([O-])(=O)=O)[C@@H]5Oc1c2[C@]45CC[NH+]3C
: