Target
Sodium- and chloride-dependent glycine transporter 1
Ligand
BDBM50188856
Substrate
Meas. Tech.
ChEMBL_379378 (CHEMBL864835)
EC50
450±n/a nM
Citation
 Alberati, DHainzl, DJolidon, SKurt, APinard, EThomas, AWZimmerli, D 4-Substituted-8-(1-phenyl-cyclohexyl)-2,8-diaza-spiro[4.5]decan-1-one as a novel class of highly selective GlyT1 inhibitors with superior pharmacological and pharmacokinetic parameters. Bioorg Med Chem Lett 16:4321-5 (2006)  
Target
Name:
Sodium- and chloride-dependent glycine transporter 1
Synonyms:
GlyT-1 Glycine Transporters (GlyT1c) SC6A9_HUMAN Sodium- and chloride-dependent glycine transporter 1 Sodium- and chloride-dependent glycine transporter 1 (GlyT1c) Solute carrier family 6 member 9
Type:
Enzyme
Mol. Mass.:
78270.54
Organism:
Homo sapiens (Human)
Description:
P48067
Residue:
706
  
Inhibitor
Name:
BDBM50188856
Synonyms:
8-[1-(4-chloro-phenyl)-cyclohexyl]-4-phenyl-2,8-diaza-spiro[4.5]decan-1-one | CHEMBL211422
Type:
Small organic molecule
Emp. Form.:
C26H31ClN2O
Mol. Mass.:
422.99
SMILES:
Clc1ccc(cc1)C1(CCCCC1)N1CCC2(CC1)C(CNC2=O)c1ccccc1
: