Target
2-dehydropantoate 2-reductase
Ligand
BDBM50192451
Substrate
Meas. Tech.
ChEMBL_382751 (CHEMBL854530)
Kd
5800±n/a nM
Citation
 Ciulli, AWilliams, GSmith, AGBlundell, TLAbell, C Probing hot spots at protein-ligand binding sites: a fragment-based approach using biophysical methods. J Med Chem 49:4992-5000 (2006)  
Target
Name:
2-dehydropantoate 2-reductase
Synonyms:
Ketopantoate reductase apbA | panE
Type:
PROTEIN
Mol. Mass.:
33866.35
Organism:
Escherichia coli (strain K12)
Description:
ChEMBL_382751
Residue:
303
  
Inhibitor
Name:
BDBM50192451
Synonyms:
CHEMBL213053 | NADP+
Type:
Small organic molecule
Emp. Form.:
C21H25N7O17P3
Mol. Mass.:
740.3828
SMILES:
NC(=O)c1ccc[n+](c1)C1OC(COP([O-])(=O)OP([O-])(=O)OC[C@H]2O[C@H]([C@H](OP([O-])([O-])=O)[C@@H]2O)n2cnc3c(N)ncnc23)[C@H](O)[C@@H]1O
: