Target
Receptor tyrosine-protein kinase erbB-2
Ligand
BDBM50189110
Substrate
Meas. Tech.
ChEMBL_396272 (CHEMBL910356)
IC50
90±n/a nM
Citation
 Petrov, KGZhang, YMCarter, MCockerill, GSDickerson, SGauthier, CAGuo, YMook, RARusnak, DWWalker, ALWood, ERLackey, KE Optimization and SAR for dual ErbB-1/ErbB-2 tyrosine kinase inhibition in the 6-furanylquinazoline series. Bioorg Med Chem Lett 16:4686-91 (2006)  
Target
Name:
Receptor tyrosine-protein kinase erbB-2
Synonyms:
2.7.10.1 CD_antigen=CD340 ERBB2_HUMAN FASN/HER2 HER2 MLN19 NEU Proto-oncogene Neu Tyrosine kinase-type cell surface receptor HER2 | p185erbB2
Type:
Mol. Mass.:
137894.47
Organism:
Homo sapiens (Human)
Description:
P04626
Residue:
1255
  
Inhibitor
Name:
BDBM50189110
Synonyms:
CHEMBL215033 | N-(4-(3-fluorobenzyloxy)-3-methoxyphenyl)-6-(5-((2-(methylsulfonyl)ethylamino)methyl)furan-2-yl)quinazolin-4-amine
Type:
Small organic molecule
Emp. Form.:
C30H29FN4O5S
Mol. Mass.:
576.638
SMILES:
COc1cc(Nc2ncnc3ccc(cc23)-c2ccc(CNCCS(C)(=O)=O)o2)ccc1OCc1cccc(F)c1
: