Target
Inositol 1,4,5-trisphosphate receptor type 1
Ligand
BDBM50184325
Substrate
Meas. Tech.
ChEMBL_399494 (CHEMBL855905)
EC50
2.1±n/a nM
Citation
 Mochizuki, TKondo, YAbe, HTovey, SCDedos, SGTaylor, CWPaul, MPotter, BVMatsuda, AShuto, S Synthesis of adenophostin A analogues conjugating an aromatic group at the 5'-position as potent IP3 receptor ligands. J Med Chem 49:5750-8 (2006)  
Target
Name:
Inositol 1,4,5-trisphosphate receptor type 1
Synonyms:
ITPR1_RAT Itpr1
Type:
PROTEIN
Mol. Mass.:
313234.63
Organism:
Rattus norvegicus
Description:
ChEMBL_818416
Residue:
2750
  
Inhibitor
Name:
BDBM50184325
Synonyms:
2-[5-(6-amino-9H-9-purinyl)-2-hydroxymethyl-4-oxyphosphate-(2R,3R,4R,5R)-tetrahydro-3-furanyloxy]-6-hydroxymethyl-4,5-dioxyphosphate-(2R,3R,4S,5R,6R)-tetrahydro-2H-3-pyranol adenophostin A
Type:
Small organic molecule
Emp. Form.:
C16H26N5O18P3
Mol. Mass.:
669.3216
SMILES:
Nc1ncnc2n(cnc12)[C@@H]1O[C@H](CO)[C@@H](O[C@H]2O[C@H](CO)[C@@H](OP(O)(O)=O)[C@H](OP(O)(O)=O)[C@H]2O)[C@H]1OP(O)(O)=O
: