Target
P2Y purinoceptor 6
Ligand
BDBM50118239
Substrate
Meas. Tech.
ChEMBL_402044 (CHEMBL866173)
EC50
13±n/a nM
Citation
 Besada, PShin, DHCostanzi, SKo, HMathé, CGagneron, JGosselin, GMaddileti, SHarden, TKJacobson, KA Structure-activity relationships of uridine 5'-diphosphate analogues at the human P2Y6 receptor. J Med Chem 49:5532-43 (2006)  
Target
Name:
P2Y purinoceptor 6
Synonyms:
P2RY6 P2Y purinoceptor 6 Pyrimidinergic receptor P2Y6
Type:
PROTEIN
Mol. Mass.:
36452.29
Organism:
Homo sapiens (Human)
Description:
ChEMBL_1511151
Residue:
328
  
Inhibitor
Name:
BDBM50118239
Synonyms:
CHEMBL130266 Uridine diphosphate | uridine 5'-(trihydrogen diphosphate)
Type:
Small organic molecule
Emp. Form.:
C9H14N2O12P2
Mol. Mass.:
404.1612
SMILES:
O[C@@H]1[C@@H](COP(O)(=O)OP(O)(O)=O)O[C@H]([C@@H]1O)n1ccc(=O)[nH]c1=O
: