Target
P2Y purinoceptor 6
Ligand
BDBM50194159
Substrate
Meas. Tech.
ChEMBL_402044 (CHEMBL866173)
EC50
4900±n/a nM
Citation
 Besada, PShin, DHCostanzi, SKo, HMathé, CGagneron, JGosselin, GMaddileti, SHarden, TKJacobson, KA Structure-activity relationships of uridine 5'-diphosphate analogues at the human P2Y6 receptor. J Med Chem 49:5532-43 (2006)  
Target
Name:
P2Y purinoceptor 6
Synonyms:
P2RY6 P2Y purinoceptor 6 Pyrimidinergic receptor P2Y6
Type:
PROTEIN
Mol. Mass.:
36452.29
Organism:
Homo sapiens (Human)
Description:
ChEMBL_1511151
Residue:
328
  
Inhibitor
Name:
BDBM50194159
Synonyms:
(2R,3R,4S,5R)-1-(3,4-dihydroxy-5-(diphosphoryloxymethyl)-tetrahydrofuran-2-yl)-4-(hexylthio)pyrimidin-2(1H)-one ammonium salt
Type:
Small organic molecule
Emp. Form.:
C15H26N2O11P2S
Mol. Mass.:
504.386
SMILES:
CCCCCCSc1ccn([C@@H]2O[C@H](COP(O)(=O)OP(O)(O)=O)[C@@H](O)[C@H]2O)c(=O)n1
: