Target
P2Y purinoceptor 2
Ligand
BDBM50194161
Substrate
Meas. Tech.
ChEMBL_402047 (CHEMBL867432)
EC50
810±n/a nM
Citation
 Besada, PShin, DHCostanzi, SKo, HMathé, CGagneron, JGosselin, GMaddileti, SHarden, TKJacobson, KA Structure-activity relationships of uridine 5'-diphosphate analogues at the human P2Y6 receptor. J Med Chem 49:5532-43 (2006)  
Target
Name:
P2Y purinoceptor 2
Synonyms:
ATP receptor P2RY2 P2U purinoceptor 1 P2Y purinoceptor 2 Purinergic receptor | Purinergic receptor P2Y2
Type:
PROTEIN
Mol. Mass.:
42299.21
Organism:
Homo sapiens (Human)
Description:
ChEMBL_1455361
Residue:
377
  
Inhibitor
Name:
BDBM50194161
Synonyms:
(2R,3R,5S)-1-(5-(diphosphoryloxymethyl)-3-hydroxytetrahydrofuran-2-yl)pyrimidine-2,4(1H,3H)-dione triethylammonium salt
Type:
Small organic molecule
Emp. Form.:
C9H14N2O11P2
Mol. Mass.:
388.1618
SMILES:
O[C@@H]1C[C@@H](COP(O)(=O)OP(O)(O)=O)O[C@H]1n1ccc(=O)[nH]c1=O
: