Target
Tyrosine-protein kinase ABL2
Ligand
BDBM50192071
Substrate
Meas. Tech.
ChEMBL_404514 (CHEMBL910897)
IC50
>1000±n/a nM
Citation
 Kawanishi, NSugimoto, TShibata, JNakamura, KMasutani, KIkuta, MHirai, H Structure-based drug design of a highly potent CDK1,2,4,6 inhibitor with novel macrocyclic quinoxalin-2-one structure. Bioorg Med Chem Lett 16:5122-6 (2006)  
Target
Name:
Tyrosine-protein kinase ABL2
Synonyms:
ABL2 ABLL Abelson murine leukemia viral oncogene homolog 2 Tyrosine kinase ARG | VHL/Tyrosine-protein kinase ABL2
Type:
PROTEIN
Mol. Mass.:
128360.63
Organism:
Homo sapiens (Human)
Description:
ChEMBL_325082
Residue:
1182
  
Inhibitor
Name:
BDBM50192071
Synonyms:
(13R,15S)-13-methyl-16-oxa-8,9,12,22,24-pentaazahexacyclo[15.6.2.1^{6,9}.1^{12,15}.0^{2,7}.0^{21,25}]heptacosa-1(24),2,4,6(27),7,17(25),18,20,22-nonaene-23,27-diol | CHEMBL215803
Type:
Small organic molecule
Emp. Form.:
C22H21N5O3
Mol. Mass.:
403.4338
SMILES:
C[C@@H]1C[C@H]2CN1CCn1[nH]c3c(cccc3c1=O)-c1nc3c(O2)cccc3[nH]c1=O
: