Target
P2Y purinoceptor 4
Ligand
BDBM50199174
Substrate
Meas. Tech.
ChEMBL_413297 (CHEMBL912410)
EC50
>100000±n/a nM
Citation
 El-Tayeb, AQi, AMüller, CE Synthesis and structure-activity relationships of uracil nucleotide derivatives and analogues as agonists at human P2Y2, P2Y4, and P2Y6 receptors. J Med Chem 49:7076-87 (2006)  
Target
Name:
P2Y purinoceptor 4
Synonyms:
NRU P2RY4 P2Y purinoceptor 4 Pyrimidinergic receptor P2Y4 Uridine nucleotide receptor
Type:
PROTEIN
Mol. Mass.:
40977.17
Organism:
Homo sapiens (Human)
Description:
ChEMBL_751027
Residue:
365
  
Inhibitor
Name:
BDBM50199174
Synonyms:
3-phenacyl-1-beta-D-ribofuranosylpyrimidine-2,4-dione 5'-monophosphate | CHEMBL215381
Type:
Small organic molecule
Emp. Form.:
C17H19N2O10P
Mol. Mass.:
442.3139
SMILES:
O[C@H]1[C@@H](O)[C@@H](O[C@@H]1COP(O)(O)=O)n1ccc(=O)n(CC(=O)c2ccccc2)c1=O
: