Target
C-X-C chemokine receptor type 1
Ligand
BDBM50200878
Substrate
Meas. Tech.
ChEMBL_422685 (CHEMBL912816)
IC50
26±n/a nM
Citation
 Dwyer, MPYu, YChao, JAki, CChao, JBiju, PGirijavallabhan, VRindgen, DBond, RMayer-Ezel, RJakway, JHipkin, RWFossetta, JGonsiorek, WBian, HFan, XTerminelli, CFine, JLundell, DMerritt, JRRokosz, LLKaiser, BLi, GWang, WStauffer, TOzgur, LBaldwin, JTaveras, AG Discovery of 2-hydroxy-N,N-dimethyl-3-{2-[[(R)-1-(5- methylfuran-2-yl)propyl]amino]-3,4-dioxocyclobut-1-enylamino}benzamide (SCH 527123): a potent, orally bioavailable CXCR2/CXCR1 receptor antagonist. J Med Chem 49:7603-6 (2006)  
Target
Name:
C-X-C chemokine receptor type 1
Synonyms:
C-X-C chemokine receptor type 1 (CXCR-1) CMKAR1 CXCR1_HUMAN Interleukin-8 receptor A | Interleukin-8 receptors, CXCR1/CXCR2
Type:
Enzyme
Mol. Mass.:
39803.83
Organism:
Homo sapiens (Human)
Description:
P25024
Residue:
350
  
Inhibitor
Name:
BDBM50200878
Synonyms:
(R)-3-(2-(1-(furan-2-yl)propylamino)-3,4-dioxocyclobut-1-enylamino)-2-hydroxy-N,N-dimethylbenzamide | CHEMBL218115
Type:
Small organic molecule
Emp. Form.:
C20H21N3O5
Mol. Mass.:
383.3978
SMILES:
CC[C@@H](Nc1c(Nc2cccc(C(=O)N(C)C)c2O)c(=O)c1=O)c1ccco1
: