Target
C-X-C chemokine receptor type 2
Ligand
BDBM50200888
Substrate
Meas. Tech.
ChEMBL_422684 (CHEMBL909848)
IC50
6.2±n/a nM
Citation
 Dwyer, MPYu, YChao, JAki, CChao, JBiju, PGirijavallabhan, VRindgen, DBond, RMayer-Ezel, RJakway, JHipkin, RWFossetta, JGonsiorek, WBian, HFan, XTerminelli, CFine, JLundell, DMerritt, JRRokosz, LLKaiser, BLi, GWang, WStauffer, TOzgur, LBaldwin, JTaveras, AG Discovery of 2-hydroxy-N,N-dimethyl-3-{2-[[(R)-1-(5- methylfuran-2-yl)propyl]amino]-3,4-dioxocyclobut-1-enylamino}benzamide (SCH 527123): a potent, orally bioavailable CXCR2/CXCR1 receptor antagonist. J Med Chem 49:7603-6 (2006)  
Target
Name:
C-X-C chemokine receptor type 2
Synonyms:
C-X-C chemokine receptor type 2 (CXCR-2) CD_antigen=CD182 CXCR-2 CXCR2_HUMAN GRO/MGSA receptor IL-8 receptor type 2 IL8RB | Interleukin-8 receptor B
Type:
Protein
Mol. Mass.:
40767.88
Organism:
Homo sapiens (Human)
Description:
P25025
Residue:
360
  
Inhibitor
Name:
BDBM50200888
Synonyms:
(R)-2-hydroxy-N,N-dimethyl-3-(2-(2-methyl-1-(5-methylfuran-2-yl)propylamino)-3,4-dioxocyclobut-1-enylamino)benzamide | CHEMBL384889
Type:
Small organic molecule
Emp. Form.:
C22H25N3O5
Mol. Mass.:
411.451
SMILES:
CC(C)[C@@H](Nc1c(Nc2cccc(C(=O)N(C)C)c2O)c(=O)c1=O)c1ccc(C)o1
: