Target
Peptide deformylase 1A, chloroplastic/mitochondrial
Ligand
BDBM50201887
Substrate
Meas. Tech.
ChEMBL_423228 (CHEMBL912247)
IC50
200000±n/a nM
Citation
 Boularot, AGiglione, CPetit, SDuroc, YAlves de Sousa, RLarue, VCresteil, TDardel, FArtaud, IMeinnel, T Discovery and refinement of a new structural class of potent peptide deformylase inhibitors. J Med Chem 50:10-20 (2007)  
Target
Name:
Peptide deformylase 1A, chloroplastic/mitochondrial
Synonyms:
AtDEF1 DEF1 PDF 1A Peptide deformylase 1A, chloroplastic | Polypeptide deformylase
Type:
PROTEIN
Mol. Mass.:
30001.50
Organism:
Arabidopsis thaliana
Description:
ChEMBL_423228
Residue:
269
  
Inhibitor
Name:
BDBM50201887
Synonyms:
1-(5-bromo-1H-indol-3-yl)-3-mercaptopropan-2-one | CHEMBL373823
Type:
Small organic molecule
Emp. Form.:
C11H10BrNOS
Mol. Mass.:
284.172
SMILES:
SCC(=O)Cc1c[nH]c2ccc(Br)cc12
: