Target
Cytochrome P450 2C19
Ligand
BDBM50201902
Substrate
Meas. Tech.
ChEMBL_423308 (CHEMBL909370)
IC50
1000±n/a nM
Citation
 Kaila, NJanz, KDeBernardo, SBedard, PWCamphausen, RTTam, STsao, DHKeith, JCNickerson-Nutter, CShilling, AYoung-Sciame, RWang, Q Synthesis and biological evaluation of quinoline salicylic acids as P-selectin antagonists. J Med Chem 50:21-39 (2007)  
Target
Name:
Cytochrome P450 2C19
Synonyms:
(R)-limonene 6-monooxygenase (S)-limonene 7-monooxygenase CYP2C19 CYPIIC19 Cytochrome P450 2C19 [I331V] Cytochrome P450-254C Mephenytoin 4-hydroxylase P450-254C
Type:
Enzyme
Mol. Mass.:
55935.47
Organism:
Homo sapiens (Human)
Description:
P33261
Residue:
490
  
Inhibitor
Name:
BDBM50201902
Synonyms:
2-(4-chlorophenyl)-3-hydroxy-7,8-dimethylquinoline-4-carboxylicacid | CHEMBL267210
Type:
Small organic molecule
Emp. Form.:
C18H14ClNO3
Mol. Mass.:
327.762
SMILES:
Cc1ccc2c(C(O)=O)c(O)c(nc2c1C)-c1ccc(Cl)cc1
: