Target
Sodium-dependent serotonin transporter
Ligand
BDBM50202398
Substrate
Meas. Tech.
ChEMBL_423469 (CHEMBL911121)
Ki
640±n/a nM
Citation
 Froimowitz, MGu, YDakin, LANagafuji, PMKelley, CJParrish, DDeschamps, JRJanowsky, A Slow-onset, long-duration, alkyl analogues of methylphenidate with enhanced selectivity for the dopamine transporter. J Med Chem 50:219-32 (2007)  
Target
Name:
Sodium-dependent serotonin transporter
Synonyms:
5-HT Transporter 5HTT SC6A4_HUMAN SLC6A4 Serotonin transporter (5HTT) Sodium-dependent serotonin transporter (SERT) | Solute carrier family 6 member 4
Type:
Multi-pass membrane protein
Mol. Mass.:
70322.51
Organism:
Homo sapiens (Human)
Description:
P31645
Residue:
630
  
Inhibitor
Name:
BDBM50202398
Synonyms:
(RR/SS)-2-[1-(4-chlorophenyl)-3-phenylpropyl]piperidine CHEMBL219281
Type:
Small organic molecule
Emp. Form.:
C20H24ClN
Mol. Mass.:
313.864
SMILES:
Clc1ccc(cc1)C(CCc1ccccc1)C1CCCCN1
: