Target
Sodium-dependent serotonin transporter
Ligand
BDBM50062912
Substrate
Meas. Tech.
ChEMBL_423470 (CHEMBL911127)
IC50
5100±n/a nM
Citation
 Froimowitz, MGu, YDakin, LANagafuji, PMKelley, CJParrish, DDeschamps, JRJanowsky, A Slow-onset, long-duration, alkyl analogues of methylphenidate with enhanced selectivity for the dopamine transporter. J Med Chem 50:219-32 (2007)  
Target
Name:
Sodium-dependent serotonin transporter
Synonyms:
5-HT Transporter 5HTT SC6A4_HUMAN SLC6A4 Serotonin transporter (5HTT) Sodium-dependent serotonin transporter (SERT) | Solute carrier family 6 member 4
Type:
Multi-pass membrane protein
Mol. Mass.:
70322.51
Organism:
Homo sapiens (Human)
Description:
P31645
Residue:
630
  
Inhibitor
Name:
BDBM50062912
Synonyms:
CHEMBL796 alpha-phenyl-2-piperidineacetic acid methyl ester methyl alpha-phenyl-alpha-2-piperidinylacetate methyl phenyl(piperidin-2-yl)acetate | methylphenidan
Type:
Small organic molecule
Emp. Form.:
C14H19NO2
Mol. Mass.:
233.3062
SMILES:
COC(=O)C(C1CCCCN1)c1ccccc1
: