Target
cAMP-specific 3',5'-cyclic phosphodiesterase 4D
Ligand
BDBM50346088
Substrate
Meas. Tech.
ChEMBL_423730 (CHEMBL855489)
IC50
39±n/a nM
Citation
 Duplantier, AJBachert, ELCheng, JBCohan, VLJenkinson, THKraus, KGMcKechney, MWPillar, JDWatson, JW SAR of a series of 5,6-dihydro-(9H)-pyrazolo[3,4-c]-1,2,4-triazolo[4,3-alpha]pyridines as potent inhibitors of human eosinophil phosphodiesterase. J Med Chem 50:344-9 (2007)  
Target
Name:
cAMP-specific 3',5'-cyclic phosphodiesterase 4D
Synonyms:
3',5'-cyclic phosphodiesterase PDE43 PDE4D_HUMAN | Phosphodiesterase 4D
Type:
Protein
Mol. Mass.:
91092.69
Organism:
Homo sapiens (Human)
Description:
Q08499
Residue:
809
  
Inhibitor
Name:
BDBM50346088
Synonyms:
(1r,4r)-4-cyano-4-(3-(cyclopentyloxy)-4-methoxyphenyl)cyclohexanecarboxylic acid 4-Cyano-4-(3-cyclopentyloxy-4-methoxy-phenyl)-cyclohexanecarboxylic acid 4-Cyano-4-(3-cyclopentyloxy-4-methoxy-phenyl)-cyclohexanecarboxylic acid methyl ester 6-(3,4-Dimethoxy-phenyl)-5-methyl-4,5-dihydro-2H-pyridazin-3-one CHEMBL511115 | SB-207499
Type:
Small organic molecule
Emp. Form.:
C20H25NO4
Mol. Mass.:
343.4168
SMILES:
COc1ccc(cc1OC1CCCC1)[C@]1(CC[C@@H](CC1)C(O)=O)C#N
: