Target
Potassium voltage-gated channel subfamily H member 2
Ligand
BDBM50123420
Substrate
Meas. Tech.
ChEMBL_424194 (CHEMBL907268)
Ki
3900±n/a nM
Citation
 Zhu, BYJia, ZJZhang, PSu, THuang, WGoldman, ETumas, DKadambi, VEddy, PSinha, UScarborough, RMSong, Y Inhibitory effect of carboxylic acid group on hERG binding. Bioorg Med Chem Lett 16:5507-12 (2006)  
Target
Name:
Potassium voltage-gated channel subfamily H member 2
Synonyms:
1,3-beta-glucan synthase component GLS2 ERG Eag-related protein 1 Ether-a-go-go-related gene (HERG) Ether-a-go-go-related gene potassium channel 1 Ether-a-go-go-related gene potassium channel 1 (hERG1) Ether-a-go-go-related protein 1 H-ERG KCNH2 Potassium voltage-gated channel subfamily H member 2 (hERG) Voltage-gated potassium channel subunit Kv11.1 hERG Potassium Channel 1 | putative potassium channel subunit
Type:
Multi-pass membrane protein
Mol. Mass.:
126672.65
Organism:
Homo sapiens (Human)
Description:
Q12809
Residue:
1159
  
Inhibitor
Name:
BDBM50123420
Synonyms:
7-[({4-[1-(1-Imino-ethyl)-piperidin-4-yloxy]-phenyl}-methanesulfonyl-amino)-methyl]-naphthalene-2-carboxamidine | CHEMBL152069
Type:
Small organic molecule
Emp. Form.:
C26H31N5O3S
Mol. Mass.:
493.621
SMILES:
CC(=N)N1CCC(CC1)Oc1ccc(cc1)N(Cc1ccc2ccc(cc2c1)C(N)=N)S(C)(=O)=O
: